Target
3-hydroxy-3-methylglutaryl-coenzyme A reductase
Ligand
BDBM50009736
Substrate
Meas. Tech.
ChEMBL_1343946 (CHEMBL3259255)
IC50
1600000±n/a nM
Citation
 Dygos, JHJett, CMChinn, LJMiller, JE Hypolipidemic activity of 5-aryl-3-methylvaleric acid derivatives. J Med Chem 20:1705-8 (1978)  
Target
Name:
3-hydroxy-3-methylglutaryl-coenzyme A reductase
Synonyms:
HMDH_RAT Hmgcr
Type:
Enzyme
Mol. Mass.:
96689.85
Organism:
Rattus norvegicus (rat)
Description:
Isolated rat liver microsomes were used as enzyme source.
Residue:
887
  
Inhibitor
Name:
BDBM50009736
Synonyms:
CHEMBL3246902
Type:
Small organic molecule
Emp. Form.:
C18H18O3
Mol. Mass.:
282.3337
SMILES:
CC(CCc1ccc2oc3ccccc3c2c1)CC(O)=O
: