Target
3-hydroxy-3-methylglutaryl-coenzyme A reductase
Ligand
BDBM50009739
Substrate
Meas. Tech.
ChEMBL_1343944 (CHEMBL3259253)
IC50
30000±n/a nM
Citation
 Dygos, JHJett, CMChinn, LJMiller, JE Hypolipidemic activity of 5-aryl-3-methylvaleric acid derivatives. J Med Chem 20:1705-8 (1978)  
Target
Name:
3-hydroxy-3-methylglutaryl-coenzyme A reductase
Synonyms:
HMDH_RAT Hmgcr
Type:
Enzyme
Mol. Mass.:
96689.85
Organism:
Rattus norvegicus (rat)
Description:
Isolated rat liver microsomes were used as enzyme source.
Residue:
887
  
Inhibitor
Name:
BDBM50009739
Synonyms:
CHEMBL3246905
Type:
Small organic molecule
Emp. Form.:
C20H22O2
Mol. Mass.:
294.3875
SMILES:
CC(CCc1ccc2CCc3ccccc3-c2c1)CC(O)=O
: