Target
3-hydroxy-3-methylglutaryl-coenzyme A reductase
Ligand
BDBM50085047
Substrate
Meas. Tech.
ChEMBL_1343945 (CHEMBL3259254)
IC50
860000±n/a nM
Citation
 Dygos, JHJett, CMChinn, LJMiller, JE Hypolipidemic activity of 5-aryl-3-methylvaleric acid derivatives. J Med Chem 20:1705-8 (1978)  
Target
Name:
3-hydroxy-3-methylglutaryl-coenzyme A reductase
Synonyms:
HMDH_RAT Hmgcr
Type:
Enzyme
Mol. Mass.:
96689.85
Organism:
Rattus norvegicus (rat)
Description:
Isolated rat liver microsomes were used as enzyme source.
Residue:
887
  
Inhibitor
Name:
BDBM50085047
Synonyms:
2-(4-Chlorophenoxy)-2-methylpropanoic acid ethyl ester CHEMBL565 EPIB Ethyl 2-(p-chlorophenoxy)isobutyrate Liprin alpha-p-Chlorophenoxyisobutyryl ethyl ester | ethyl 2-(4-chlorophenoxy)-2-methylpropanoate
Type:
Small organic molecule
Emp. Form.:
C12H15ClO3
Mol. Mass.:
242.699
SMILES:
CCOC(=O)C(C)(C)Oc1ccc(Cl)cc1
: