Target
GTP:AMP phosphotransferase AK3, mitochondrial
Ligand
BDBM50010316
Substrate
Meas. Tech.
ChEMBL_1340551 (CHEMBL3254975)
Ki
6200000±n/a nM
Citation
 Hampton, APicker, D Design of species- or isozyme-specific enzyme inhibitors. 3. Species and isozymic differences between mammalian and bacterial adenylate kinases in substituent tolerance in an enzyme-substrate complex. J Med Chem 22:1529-32 (1980)  
Target
Name:
GTP:AMP phosphotransferase AK3, mitochondrial
Synonyms:
AK 3 Adenylate kinase 3 alpha like 1 Ak3 Akl3l KAD3_RAT
Type:
PROTEIN
Mol. Mass.:
25443.58
Organism:
Rattus norvegicus
Description:
ChEMBL_1340551
Residue:
227
  
Inhibitor
Name:
BDBM50010316
Synonyms:
CHEMBL3251364
Type:
Small organic molecule
Emp. Form.:
C17H28IN6O14P3
Mol. Mass.:
760.2618
SMILES:
O[C@@H]1[C@@H](COP(O)(=O)OP(O)(=O)OP(O)(O)=O)O[C@H]([C@@H]1O)n1cnc2c(NCCCCCNC(=O)CI)ncnc12
: