Target
Plasmepsin I
Ligand
BDBM50010894
Substrate
Meas. Tech.
ChEMBL_1353678 (CHEMBL3271467)
IC50
360±n/a nM
Citation
 Jaudzems, KTars, KMaurops, GIvdra, NOtikovs, MLeitans, JKanepe-Lapsa, IDomraceva, IMutule, ITrapencieris, PBlackman, MJJirgensons, A Plasmepsin inhibitory activity and structure-guided optimization of a potent hydroxyethylamine-based antimalarial hit. ACS Med Chem Lett 5:373-7 (2014)  
Target
Name:
Plasmepsin I
Synonyms:
PFAPG PMI Plasmepsin-1 precursor
Type:
Enzyme
Mol. Mass.:
51463.30
Organism:
Plasmodium falciparum
Description:
Residue:
452
  
Inhibitor
Name:
BDBM50010894
Synonyms:
CHEMBL3264800
Type:
Small organic molecule
Emp. Form.:
C38H52N4O4
Mol. Mass.:
628.8439
SMILES:
CCCN(CCC)C(=O)c1cc(cc(c1)C(=O)N[C@@H](Cc1ccccc1)[C@H](O)CNC(C)(C)c1cccc(O)c1)N1CCCCC1
: