Target
Adenosine receptor A1
Ligand
BDBM50011300
Substrate
Meas. Tech.
ChEMBL_1352084 (CHEMBL3267349)
Ki
24±n/a nM
Citation
 de Lera Ruiz, MLim, YHZheng, J Adenosine A2A receptor as a drug discovery target. J Med Chem 57:3623-50 (2014)  
Target
Name:
Adenosine receptor A1
Synonyms:
A1 adenosine receptor (hA1) AA1R_HUMAN ADORA1 Adenosine A1-receptor Adenosine receptor A1 (hA1) | Adenosine transporter (AdT)
Type:
G Protein-Coupled Receptor (GPCR)
Mol. Mass.:
36520.92
Organism:
Homo sapiens (Human)
Description:
P30542
Residue:
326
  
Inhibitor
Name:
BDBM50011300
Synonyms:
CHEMBL2398482 | US9133197, 2
Type:
Small organic molecule
Emp. Form.:
C12H16N8O
Mol. Mass.:
288.3084
SMILES:
CC(O)CCc1nc(N)c2nc(-n3nccn3)n(C)c2n1
: