Target
Adenosine receptor A2a
Ligand
BDBM50150766
Substrate
Meas. Tech.
ChEMBL_1352100 (CHEMBL3267365)
EC50
9.0±n/a nM
Citation
 de Lera Ruiz, MLim, YHZheng, J Adenosine A2A receptor as a drug discovery target. J Med Chem 57:3623-50 (2014)  
Target
Name:
Adenosine receptor A2a
Synonyms:
A2A adenosine receptor (hA2A) ADENOSINE A2 ADORA2 Adenosine A2A receptor (A2AAR)
Type:
G Protein-Coupled Receptor (GPCR)
Mol. Mass.:
44716.46
Organism:
Homo sapiens (Human)
Description:
P29274
Residue:
412
  
Inhibitor
Name:
BDBM50150766
Synonyms:
(2R,3R,4S,5R)-2-(6-amino-2-((S)-1-hydroxy-3-phenylpropan-2-ylamino)-9H-purin-9-yl)-5-(2-ethyl-2H-tetrazol-5-yl)tetrahydrofuran-3,4-diol CHEMBL186113 | GW-328267
Type:
Small organic molecule
Emp. Form.:
C21H26N10O4
Mol. Mass.:
482.4957
SMILES:
CCn1nnc(n1)[C@H]1O[C@H]([C@H](O)[C@@H]1O)n1cnc2c(N)nc(N[C@H](CO)Cc3ccccc3)nc12
: