Target
Geranylgeranyl pyrophosphate synthase
Ligand
BDBM50388398
Substrate
Meas. Tech.
ChEMBL_1352845 (CHEMBL3269017)
IC50
4500±n/a nM
Citation
 Li, KSchurig-Briccio, LAFeng, XUpadhyay, APujari, VLechartier, BFontes, FLYang, HRao, GZhu, WGulati, ANo, JHCintra, GBogue, SLiu, YLMolohon, KOrlean, PMitchell, DAFreitas-Junior, LRen, FSun, HJiang, TLi, YGuo, RTCole, STGennis, RBCrick, DCOldfield, E Multitarget drug discovery for tuberculosis and other infectious diseases. J Med Chem 57:3126-39 (2014)  
Target
Name:
Geranylgeranyl pyrophosphate synthase
Synonyms:
Dimethylallyltranstransferase GGPP synthetase GGPPSase Geranylgeranyl Diphosphate Synthase (GGPPS) Geranylgeranyl pyrophosphate synthetase | Geranyltranstransferase
Type:
Homooctamer; transferase
Mol. Mass.:
34867.94
Organism:
Homo sapiens (Human)
Description:
Recombinant human GGPPS was cloned and expressed in E. coli.
Residue:
300
  
Inhibitor
Name:
BDBM50388398
Synonyms:
CHEMBL561057 | SQ-109
Type:
Small organic molecule
Emp. Form.:
C22H38N2
Mol. Mass.:
330.5505
SMILES:
CC(C)=CCC\C(C)=C\CNCCNC1C2CC3CC(C2)CC1C3
: