Target
4,4'-diapophytoene synthase
Ligand
BDBM50388398
Substrate
Meas. Tech.
ChEMBL_1352846 (CHEMBL3269018)
IC50
100000±n/a nM
Citation
 Li, KSchurig-Briccio, LAFeng, XUpadhyay, APujari, VLechartier, BFontes, FLYang, HRao, GZhu, WGulati, ANo, JHCintra, GBogue, SLiu, YLMolohon, KOrlean, PMitchell, DAFreitas-Junior, LRen, FSun, HJiang, TLi, YGuo, RTCole, STGennis, RBCrick, DCOldfield, E Multitarget drug discovery for tuberculosis and other infectious diseases. J Med Chem 57:3126-39 (2014)  
Target
Name:
4,4'-diapophytoene synthase
Synonyms:
CRTM_STAAU crtM
Type:
PROTEIN
Mol. Mass.:
34309.10
Organism:
Staphylococcus aureus
Description:
ChEMBL_1352846
Residue:
287
  
Inhibitor
Name:
BDBM50388398
Synonyms:
CHEMBL561057 | SQ-109
Type:
Small organic molecule
Emp. Form.:
C22H38N2
Mol. Mass.:
330.5505
SMILES:
CC(C)=CCC\C(C)=C\CNCCNC1C2CC3CC(C2)CC1C3
: