Target
Squalene synthase
Ligand
BDBM50011480
Substrate
Meas. Tech.
ChEMBL_1352847 (CHEMBL3269019)
IC50
100000±n/a nM
Citation
 Li, KSchurig-Briccio, LAFeng, XUpadhyay, APujari, VLechartier, BFontes, FLYang, HRao, GZhu, WGulati, ANo, JHCintra, GBogue, SLiu, YLMolohon, KOrlean, PMitchell, DAFreitas-Junior, LRen, FSun, HJiang, TLi, YGuo, RTCole, STGennis, RBCrick, DCOldfield, E Multitarget drug discovery for tuberculosis and other infectious diseases. J Med Chem 57:3126-39 (2014)  
Target
Name:
Squalene synthase
Synonyms:
FDFT1 FPP:FPP farnesyltransferase SQS Squalene synthetase
Type:
PROTEIN
Mol. Mass.:
48114.76
Organism:
Homo sapiens (Human)
Description:
ChEMBL_1352847
Residue:
417
  
Inhibitor
Name:
BDBM50011480
Synonyms:
CHEMBL3261881
Type:
Small organic molecule
Emp. Form.:
C22H37NO
Mol. Mass.:
331.5353
SMILES:
CC(C)=CCC\C(C)=C\COCCNC1C2CC3CC(C2)CC1C3
: