Target
Peroxisome proliferator-activated receptor alpha
Ligand
BDBM50135780
Substrate
Meas. Tech.
ChEMBL_1349372 (CHEMBL3269595)
EC50
42±n/a nM
Citation
 Bravo, YBaccei, CSBroadhead, ABundey, RChen, AClark, RCorrea, LJacintho, JDLorrain, DSMessmer, DStebbins, KPrasit, PStock, N Identification of the first potent, selective and bioavailable PPARa antagonist. Bioorg Med Chem Lett 24:2267-72 (2014)  
Target
Name:
Peroxisome proliferator-activated receptor alpha
Synonyms:
NR1C1 PPAR PPAR-alpha PPARA_HUMAN Peroxisome proliferator-activated receptor | Peroxisome proliferator-activated receptor alpha (PPAR alpha)
Type:
Enzyme
Mol. Mass.:
52222.08
Organism:
Homo sapiens (Human)
Description:
Q07869
Residue:
468
  
Inhibitor
Name:
BDBM50135780
Synonyms:
2-Methyl-2-(4-{3-[1-(4-methyl-benzyl)-5-oxo-4,5-dihydro-1H-[1,2,4]triazol-3-yl]-propyl}-phenoxy)-propionic acid | CHEMBL424133
Type:
Small organic molecule
Emp. Form.:
C23H27N3O4
Mol. Mass.:
409.4782
SMILES:
Cc1ccc(Cn2nc(CCCc3ccc(OC(C)(C)C(O)=O)cc3)[nH]c2=O)cc1
: