Target
Carbonic anhydrase 1
Ligand
BDBM10861
Substrate
Meas. Tech.
ChEMBL_1349401 (CHEMBL3269991)
Ki
160±n/a nM
Citation
 Nasr, GCristian, ABarboiu, MVullo, DWinum, JYSupuran, CT Carbonic anhydrase inhibitors. Inhibition of human cytosolic isoforms I and II with (reduced) Schiff's bases incorporating sulfonamide, carboxylate and carboxymethyl moieties. Bioorg Med Chem 22:2867-74 (2014)  
Target
Name:
Carbonic anhydrase 1
Synonyms:
CA-I CAB Carbonate dehydratase I Carbonic anhydrase 1 (CA I) Carbonic anhydrase 1 (Recombinant CA I) Carbonic anhydrase B Carbonic anhydrase I (CA I) Carbonic anhydrase I (CAI) Carbonic anhydrase isoenzyme I (hCA I) | hCA
Type:
Enzyme
Mol. Mass.:
28873.37
Organism:
Homo sapiens (Human)
Description:
P00915
Residue:
261
  
Inhibitor
Name:
BDBM10861
Synonyms:
4-(2-aminoethyl)benzene-1-sulfonamide aromatic sulfonamide compound 7 | aromatic/heteroaromatic sulfonamide 6
Type:
Small organic molecule
Emp. Form.:
C8H12N2O2S
Mol. Mass.:
200.258
SMILES:
NCCc1ccc(cc1)S(N)(=O)=O
: