Target
Aminopeptidase N
Ligand
BDBM50014567
Substrate
Meas. Tech.
ChEMBL_1350983 (CHEMBL3268882)
IC50
87950±n/a nM
Citation
 Zhang, JLi, XJiang, YFeng, JLi, XZhang, YXu, W Design, synthesis and preliminary evaluation ofa-sulfonyl¿-(glycinyl-amino)proline peptidomimetics as matrix metalloproteinase inhibitors. Bioorg Med Chem 22:3055-64 (2014)  
Target
Name:
Aminopeptidase N
Synonyms:
AMPN_PIG AP-M Alanyl aminopeptidase Aminopeptidase N (APN) Microsomal aminopeptidase pAPN
Type:
Protein
Mol. Mass.:
108810.25
Organism:
Sus scrofa (Pig)
Description:
P15145
Residue:
963
  
Inhibitor
Name:
BDBM50014567
Synonyms:
CHEMBL3261752
Type:
Small organic molecule
Emp. Form.:
C23H30ClN5O6S
Mol. Mass.:
540.032
SMILES:
Cl.Cc1ccc(cc1)S(=O)(=O)N1C[C@H](C[C@H]1C(=O)NO)NC(=O)CNC(=O)[C@@H](N)Cc1ccccc1
: