Target
Aminopeptidase N
Ligand
BDBM50014589
Substrate
Meas. Tech.
ChEMBL_1350983 (CHEMBL3268882)
IC50
72290±n/a nM
Citation
 Zhang, JLi, XJiang, YFeng, JLi, XZhang, YXu, W Design, synthesis and preliminary evaluation ofa-sulfonyl¿-(glycinyl-amino)proline peptidomimetics as matrix metalloproteinase inhibitors. Bioorg Med Chem 22:3055-64 (2014)  
Target
Name:
Aminopeptidase N
Synonyms:
AMPN_PIG AP-M Alanyl aminopeptidase Aminopeptidase N (APN) Microsomal aminopeptidase pAPN
Type:
Protein
Mol. Mass.:
108810.25
Organism:
Sus scrofa (Pig)
Description:
P15145
Residue:
963
  
Inhibitor
Name:
BDBM50014589
Synonyms:
CHEMBL3261762
Type:
Small organic molecule
Emp. Form.:
C19H29Cl2N5O6S
Mol. Mass.:
526.434
SMILES:
Cl.CC(C)C[C@H](N)C(=O)NCC(=O)N[C@H]1C[C@H](N(C1)S(=O)(=O)c1ccc(Cl)cc1)C(=O)NO
: