Target
72 kDa type IV collagenase
Ligand
BDBM50014585
Substrate
Meas. Tech.
ChEMBL_1347847 (CHEMBL3266749)
IC50
31540±n/a nM
Citation
 Zhang, JLi, XJiang, YFeng, JLi, XZhang, YXu, W Design, synthesis and preliminary evaluation ofa-sulfonyl¿-(glycinyl-amino)proline peptidomimetics as matrix metalloproteinase inhibitors. Bioorg Med Chem 22:3055-64 (2014)  
Target
Name:
72 kDa type IV collagenase
Synonyms:
72 kDa gelatinase CLG4A Gelatinase A (MMP-2) MMP2_HUMAN Matrix metalloproteinase-2 (MMP 2) Matrix metalloproteinases 2 (MMP-2) | TBE-1
Type:
Enzyme
Mol. Mass.:
73870.36
Organism:
Homo sapiens (Human)
Description:
P08253
Residue:
660
  
Inhibitor
Name:
BDBM50014585
Synonyms:
CHEMBL3261758
Type:
Small organic molecule
Emp. Form.:
C23H30ClN5O7S
Mol. Mass.:
556.032
SMILES:
Cl.COc1ccc(cc1)S(=O)(=O)N1C[C@H](C[C@H]1C(=O)NO)NC(=O)CNC(=O)[C@@H](N)Cc1ccccc1
: