Target
72 kDa type IV collagenase
Ligand
BDBM50014596
Substrate
Meas. Tech.
ChEMBL_1350982 (CHEMBL3268881)
IC50
1520±n/a nM
Citation
 Zhang, JLi, XJiang, YFeng, JLi, XZhang, YXu, W Design, synthesis and preliminary evaluation ofa-sulfonyl¿-(glycinyl-amino)proline peptidomimetics as matrix metalloproteinase inhibitors. Bioorg Med Chem 22:3055-64 (2014)  
Target
Name:
72 kDa type IV collagenase
Synonyms:
72 kDa gelatinase CLG4A Gelatinase A (MMP-2) MMP2_HUMAN Matrix metalloproteinase-2 (MMP 2) Matrix metalloproteinases 2 (MMP-2) | TBE-1
Type:
Enzyme
Mol. Mass.:
73870.36
Organism:
Homo sapiens (Human)
Description:
P08253
Residue:
660
  
Inhibitor
Name:
BDBM50014596
Synonyms:
CHEMBL3261744
Type:
Small organic molecule
Emp. Form.:
C19H30ClN5O6S
Mol. Mass.:
491.989
SMILES:
Cl.CC(C)C[C@H](N)C(=O)NCC(=O)N[C@H]1C[C@H](N(C1)S(=O)(=O)c1ccccc1)C(=O)NO
: