Target
Arylamine N-acetyltransferase 1
Ligand
BDBM50014922
Substrate
Meas. Tech.
ChEMBL_1347886 (CHEMBL3267122)
IC50
2800±n/a nM
Citation
 Egleton, JEThinnes, CCSeden, PTLaurieri, NLee, SPHadavizadeh, KSMeasures, ARJones, AMThompson, SVarney, AWynne, GMRyan, ASim, ERussell, AJ Structure-activity relationships and colorimetric properties of specific probes for the putative cancer biomarker human arylamine N-acetyltransferase 1. Bioorg Med Chem 22:3030-54 (2014)  
Target
Name:
Arylamine N-acetyltransferase 1
Synonyms:
AAC1 NAT1
Type:
PROTEIN
Mol. Mass.:
33898.32
Organism:
Homo sapiens (Human)
Description:
ChEMBL_1347886
Residue:
290
  
Inhibitor
Name:
BDBM50014922
Synonyms:
CHEMBL3262053
Type:
Small organic molecule
Emp. Form.:
C22H15NO5S
Mol. Mass.:
405.423
SMILES:
O=C1C(NS(=O)(=O)c2ccccc2)=C(Oc2ccccc2)C(=O)c2ccccc12
: