Target
Tyrosine-protein kinase SYK
Ligand
BDBM50015427
Substrate
Meas. Tech.
ChEMBL_1348182 (CHEMBL3270297)
EC50
24±n/a nM
Citation
 Currie, KSKropf, JELee, TBlomgren, PXu, JZhao, ZGallion, SWhitney, JAMaclin, DLansdon, EBMaciejewski, PRossi, AMRong, HMacaluso, JBarbosa, JDi Paolo, JAMitchell, SA Discovery of GS-9973, a selective and orally efficacious inhibitor of spleen tyrosine kinase. J Med Chem 57:3856-73 (2014)  
Target
Name:
Tyrosine-protein kinase SYK
Synonyms:
KSYK_HUMAN Spleen Tyrosine Kinase Tyrosine-protein kinase SYK (Syk)
Type:
Enzyme
Mol. Mass.:
72079.99
Organism:
Homo sapiens (Human)
Description:
P43405
Residue:
635
  
Inhibitor
Name:
BDBM50015427
Synonyms:
CHEMBL3265017
Type:
Small organic molecule
Emp. Form.:
C21H18N6O2
Mol. Mass.:
386.4066
SMILES:
COc1ccc(Nc2nc(cn3ccnc23)-c2ccc3cn[nH]c3c2)cc1OC
: