Target
Tyrosine-protein kinase SYK
Ligand
BDBM50015453
Substrate
Meas. Tech.
ChEMBL_1348182 (CHEMBL3270297)
EC50
20±n/a nM
Citation
 Currie, KSKropf, JELee, TBlomgren, PXu, JZhao, ZGallion, SWhitney, JAMaclin, DLansdon, EBMaciejewski, PRossi, AMRong, HMacaluso, JBarbosa, JDi Paolo, JAMitchell, SA Discovery of GS-9973, a selective and orally efficacious inhibitor of spleen tyrosine kinase. J Med Chem 57:3856-73 (2014)  
Target
Name:
Tyrosine-protein kinase SYK
Synonyms:
KSYK_HUMAN Spleen Tyrosine Kinase Tyrosine-protein kinase SYK (Syk)
Type:
Enzyme
Mol. Mass.:
72079.99
Organism:
Homo sapiens (Human)
Description:
P43405
Residue:
635
  
Inhibitor
Name:
BDBM50015453
Synonyms:
CHEMBL3265037
Type:
Small organic molecule
Emp. Form.:
C24H23N7O2
Mol. Mass.:
441.4851
SMILES:
COc1cc(Nc2nc(cn3ccnc23)-c2ccc3cn[nH]c3c2)ccc1N1CCOCC1
: