Target
Tyrosine-protein kinase SYK
Ligand
BDBM50015448
Substrate
Meas. Tech.
ChEMBL_1348372 (CHEMBL3265576)
EC50
41±n/a nM
Citation
 Currie, KSKropf, JELee, TBlomgren, PXu, JZhao, ZGallion, SWhitney, JAMaclin, DLansdon, EBMaciejewski, PRossi, AMRong, HMacaluso, JBarbosa, JDi Paolo, JAMitchell, SA Discovery of GS-9973, a selective and orally efficacious inhibitor of spleen tyrosine kinase. J Med Chem 57:3856-73 (2014)  
Target
Name:
Tyrosine-protein kinase SYK
Synonyms:
KSYK_HUMAN Spleen Tyrosine Kinase Tyrosine-protein kinase SYK (Syk)
Type:
Enzyme
Mol. Mass.:
72079.99
Organism:
Homo sapiens (Human)
Description:
P43405
Residue:
635
  
Inhibitor
Name:
BDBM50015448
Synonyms:
CHEMBL3265032
Type:
Small organic molecule
Emp. Form.:
C23H21N7O
Mol. Mass.:
411.4591
SMILES:
C1CN(CCO1)c1ccc(Nc2nc(cn3ccnc23)-c2ccc3cn[nH]c3c2)cc1
: