Target
Casein kinase I isoform delta
Ligand
BDBM50016163
Substrate
Meas. Tech.
ChEMBL_1350338 (CHEMBL3268059)
IC50
84±n/a nM
Citation
 Reichelt, ABailis, JMBartberger, MDYao, GShu, HKaller, MRAllen, JGWeidner, MFKeegan, KSDao, JH Synthesis and structure-activity relationship of trisubstituted thiazoles as Cdc7 kinase inhibitors. Eur J Med Chem 80:364-82 (2014)  
Target
Name:
Casein kinase I isoform delta
Synonyms:
CKI-delta CSNK1D Casein kinase I delta Casein kinase I isoform delta (CK1D) KC1D_HUMAN | casein kinases 1 delta (CK1 delta)
Type:
Enzyme
Mol. Mass.:
47356.76
Organism:
Homo sapiens (Human)
Description:
P48730
Residue:
415
  
Inhibitor
Name:
BDBM50016163
Synonyms:
CHEMBL3261514
Type:
Small organic molecule
Emp. Form.:
C14H9Cl2N5OS
Mol. Mass.:
366.225
SMILES:
NC(=O)c1sc(nc1-c1ccc(Cl)cc1Cl)-c1ccnc(N)n1
: