Target
Histamine N-methyltransferase
Ligand
BDBM50016564
Substrate
Meas. Tech.
ChEMBL_1357416 (CHEMBL3281574)
Ki
31600±n/a nM
Citation
 Ahmed, AEHanna, PEGrund, VR Conformationally restricted analogs of histamine H1 receptor antagonists: trans and cis-1-benzyl-3-dimethylamino-6-phenylpiperidine. J Med Chem 19:117-22 (1976)  
Target
Name:
Histamine N-methyltransferase
Synonyms:
HMT HNMT_CAVPO
Type:
PROTEIN
Mol. Mass.:
33709.50
Organism:
Cavia porcellus
Description:
ChEMBL_100022
Residue:
292
  
Inhibitor
Name:
BDBM50016564
Synonyms:
CHEMBL3272448
Type:
Small organic molecule
Emp. Form.:
C20H26N2
Mol. Mass.:
294.4338
SMILES:
CN(C)[C@@H]1CC[C@@H](N(Cc2ccccc2)C1)c1ccccc1
: