Target
Melanocortin receptor 3
Ligand
BDBM50017131
Substrate
Meas. Tech.
ChEMBL_1365586 (CHEMBL3297367)
EC50
47±n/a nM
Citation
 Haslach, EMHuang, HDirain, MDebevec, GGeer, PSantos, RGGiulianotti, MAPinilla, CAppel, JRDoering, SRWalters, MAHoughten, RAHaskell-Luevano, C Identification of tetrapeptides from a mixture based positional scanning library that can restore nM full agonist function of the L106P, I69T, I102S, A219V, C271Y, and C271R human melanocortin-4 polymorphic receptors (hMC4Rs). J Med Chem 57:4615-28 (2014)  
Target
Name:
Melanocortin receptor 3
Synonyms:
MC3-R Mc3r
Type:
PROTEIN
Mol. Mass.:
35808.24
Organism:
Mus musculus
Description:
ChEMBL_1498848
Residue:
323
  
Inhibitor
Name:
BDBM50017131
Synonyms:
CHEMBL3287324
Type:
Small organic molecule
Emp. Form.:
C36H42IN9O7
Mol. Mass.:
839.6793
SMILES:
CC(=O)N[C@@H](CCCNC(N)=N)C(=O)N[C@H](Cc1ccc(I)cc1)C(=O)N1Cc2ccccc2CC1C(=O)N[C@H](Cc1ccc(cc1)[N+]([O-])=O)C(N)=O
: