Target
Melanocortin receptor 4
Ligand
BDBM50017133
Substrate
Meas. Tech.
ChEMBL_1365587 (CHEMBL3297368)
EC50
5.2±n/a nM
Citation
 Haslach, EMHuang, HDirain, MDebevec, GGeer, PSantos, RGGiulianotti, MAPinilla, CAppel, JRDoering, SRWalters, MAHoughten, RAHaskell-Luevano, C Identification of tetrapeptides from a mixture based positional scanning library that can restore nM full agonist function of the L106P, I69T, I102S, A219V, C271Y, and C271R human melanocortin-4 polymorphic receptors (hMC4Rs). J Med Chem 57:4615-28 (2014)  
Target
Name:
Melanocortin receptor 4
Synonyms:
MC4-R Mc4r
Type:
PROTEIN
Mol. Mass.:
36964.43
Organism:
Mus musculus
Description:
ChEMBL_1498850
Residue:
332
  
Inhibitor
Name:
BDBM50017133
Synonyms:
CHEMBL3287326
Type:
Small organic molecule
Emp. Form.:
C36H37ClN8O7
Mol. Mass.:
729.181
SMILES:
CC(=O)N[C@@H](Cc1cnc[nH]1)C(=O)N[C@H](Cc1ccc(Cl)cc1)C(=O)N1Cc2ccccc2CC1C(=O)N[C@H](Cc1ccc(cc1)[N+]([O-])=O)C(N)=O
: