Target
Delta-aminolevulinic acid dehydratase
Ligand
BDBM50017192
Substrate
Meas. Tech.
ChEMBL_1365593 (CHEMBL3297374)
IC50
205000±n/a nM
Citation
 Lentz, CSHalls, VSHannam, JSStrassel, SLawrence, SHJaffe, EKFamulok, MHoerauf, APfarr, KM wALADin benzimidazoles differentially modulate the function of porphobilinogen synthase orthologs. J Med Chem 57:2498-510 (2014)  
Target
Name:
Delta-aminolevulinic acid dehydratase
Synonyms:
Type:
PROTEIN
Mol. Mass.:
36671.06
Organism:
Wolbachia sp. subsp. Brugia malayi (strain TRS)
Description:
ChEMBL_108383
Residue:
331
  
Inhibitor
Name:
BDBM50017192
Synonyms:
CHEMBL3287368
Type:
Small organic molecule
Emp. Form.:
C16H14N2O3
Mol. Mass.:
282.294
SMILES:
COc1cccc(Cn2cnc3cc(ccc23)C(O)=O)c1
: