Target
Delta-aminolevulinic acid dehydratase
Ligand
BDBM50441099
Substrate
Meas. Tech.
ChEMBL_1365622 (CHEMBL3297469)
IC50
1111000±n/a nM
Citation
 Lentz, CSHalls, VSHannam, JSStrassel, SLawrence, SHJaffe, EKFamulok, MHoerauf, APfarr, KM wALADin benzimidazoles differentially modulate the function of porphobilinogen synthase orthologs. J Med Chem 57:2498-510 (2014)  
Target
Name:
Delta-aminolevulinic acid dehydratase
Synonyms:
Dmel_CG10335 EMBL:AAL48669.1 FlyBase:FBgn0036271} | Pbgs
Type:
PROTEIN
Mol. Mass.:
35938.25
Organism:
Drosophila melanogaster
Description:
ChEMBL_108389
Residue:
327
  
Inhibitor
Name:
BDBM50441099
Synonyms:
CHEMBL2430574
Type:
Small organic molecule
Emp. Form.:
C23H18F3N3O3S
Mol. Mass.:
473.468
SMILES:
OC(=O)c1ccc2n(Cc3cccc(c3)C(F)(F)F)c(CCNC(=O)c3cccs3)nc2c1
: