Target
Metabotropic glutamate receptor 6
Ligand
BDBM50017269
Substrate
Meas. Tech.
ChEMBL_1362023 (CHEMBL3294094)
EC50
>10000±n/a nM
Citation
 Dhanya, RPSheffler, DJDahl, RDavis, MLee, PSYang, LNickols, HHCho, HPSmith, LHD'Souza, MSConn, PJDer-Avakian, AMarkou, ACosford, ND Design and synthesis of systemically active metabotropic glutamate subtype-2 and -3 (mGlu2/3) receptor positive allosteric modulators (PAMs): pharmacological characterization and assessment in a rat model of cocaine dependence. J Med Chem 57:4154-72 (2014)  
Target
Name:
Metabotropic glutamate receptor 6
Synonyms:
GRM6_RAT Grm6 Metabotropic glutamate receptor 6 (mGlu6) mGlu6 | metabotropic glutamate 6
Type:
Enzyme
Mol. Mass.:
95095.82
Organism:
Rattus norvegicus (Rat)
Description:
P35349
Residue:
871
  
Inhibitor
Name:
BDBM50017269
Synonyms:
CHEMBL3287724 | US10099993, Compound 73
Type:
Small organic molecule
Emp. Form.:
C25H32O7
Mol. Mass.:
444.5174
SMILES:
COc1cc(ccc1OCCCCOc1ccc(C(=O)CC(C)(C)C)c(O)c1C)C(O)=O
: