Target
Amine oxidase [flavin-containing] A
Ligand
BDBM50017426
Substrate
Meas. Tech.
ChEMBL_1363618 (CHEMBL3292881)
IC50
207±n/a nM
Citation
 Legoabe, LJPetzer, APetzer, JP a-Tetralone derivatives as inhibitors of monoamine oxidase. Bioorg Med Chem Lett 24:2758-63 (2014)  
Target
Name:
Amine oxidase [flavin-containing] A
Synonyms:
AOFA_HUMAN MAO-A Monoamine oxidase Monoamine oxidase type A (MAO A) Monoamine oxidase type A (MAOA)
Type:
Protein
Mol. Mass.:
59689.53
Organism:
Homo sapiens (Human)
Description:
P21397
Residue:
527
  
Inhibitor
Name:
BDBM50017426
Synonyms:
CHEMBL3288294
Type:
Small organic molecule
Emp. Form.:
C17H15ClO2
Mol. Mass.:
286.753
SMILES:
Clc1cccc(COc2ccc3C(=O)CCCc3c2)c1
: