Target
Amine oxidase [flavin-containing] A
Ligand
BDBM50017475
Substrate
Meas. Tech.
ChEMBL_1363618 (CHEMBL3292881)
IC50
2090±n/a nM
Citation
 Legoabe, LJPetzer, APetzer, JP a-Tetralone derivatives as inhibitors of monoamine oxidase. Bioorg Med Chem Lett 24:2758-63 (2014)  
Target
Name:
Amine oxidase [flavin-containing] A
Synonyms:
AOFA_HUMAN MAO-A Monoamine oxidase Monoamine oxidase type A (MAO A) Monoamine oxidase type A (MAOA)
Type:
Protein
Mol. Mass.:
59689.53
Organism:
Homo sapiens (Human)
Description:
P21397
Residue:
527
  
Inhibitor
Name:
BDBM50017475
Synonyms:
CHEMBL3288300
Type:
Small organic molecule
Emp. Form.:
C18H18O2
Mol. Mass.:
266.3343
SMILES:
Cc1ccc(COc2ccc3C(=O)CCCc3c2)cc1
: