Target
Amine oxidase [flavin-containing] A
Ligand
BDBM50017515
Substrate
Meas. Tech.
ChEMBL_1363618 (CHEMBL3292881)
IC50
43800±n/a nM
Citation
 Legoabe, LJPetzer, APetzer, JP a-Tetralone derivatives as inhibitors of monoamine oxidase. Bioorg Med Chem Lett 24:2758-63 (2014)  
Target
Name:
Amine oxidase [flavin-containing] A
Synonyms:
AOFA_HUMAN MAO-A Monoamine oxidase Monoamine oxidase type A (MAO A) Monoamine oxidase type A (MAOA)
Type:
Protein
Mol. Mass.:
59689.53
Organism:
Homo sapiens (Human)
Description:
P21397
Residue:
527
  
Inhibitor
Name:
BDBM50017515
Synonyms:
CHEMBL3288306
Type:
Small organic molecule
Emp. Form.:
C10H10O2
Mol. Mass.:
162.1852
SMILES:
Oc1ccc2C(=O)CCCc2c1
: