Target
Amine oxidase [flavin-containing] B
Ligand
BDBM50017424
Substrate
Meas. Tech.
ChEMBL_1363619 (CHEMBL3292882)
IC50
17±n/a nM
Citation
 Legoabe, LJPetzer, APetzer, JP a-Tetralone derivatives as inhibitors of monoamine oxidase. Bioorg Med Chem Lett 24:2758-63 (2014)  
Target
Name:
Amine oxidase [flavin-containing] B
Synonyms:
AOFB_HUMAN MAOB Monoamine oxidase type B (MAO B) Monoamine oxidase type B (MAOB)
Type:
Protein
Mol. Mass.:
58768.76
Organism:
Homo sapiens (Human)
Description:
P27338
Residue:
520
  
Inhibitor
Name:
BDBM50017424
Synonyms:
CHEMBL3288292
Type:
Small organic molecule
Emp. Form.:
C17H15FO2
Mol. Mass.:
270.2982
SMILES:
Fc1cccc(COc2ccc3C(=O)CCCc3c2)c1
: