Target
Amine oxidase [flavin-containing] B
Ligand
BDBM50159254
Substrate
Meas. Tech.
ChEMBL_1363619 (CHEMBL3292882)
IC50
18600±n/a nM
Citation
 Legoabe, LJPetzer, APetzer, JP a-Tetralone derivatives as inhibitors of monoamine oxidase. Bioorg Med Chem Lett 24:2758-63 (2014)  
Target
Name:
Amine oxidase [flavin-containing] B
Synonyms:
AOFB_HUMAN MAOB Monoamine oxidase type B (MAO B) Monoamine oxidase type B (MAOB)
Type:
Protein
Mol. Mass.:
58768.76
Organism:
Homo sapiens (Human)
Description:
P27338
Residue:
520
  
Inhibitor
Name:
BDBM50159254
Synonyms:
3,4-Dihydro-2H-naphthalen-1-one CHEMBL193373
Type:
Small organic molecule
Emp. Form.:
C10H10O
Mol. Mass.:
146.1858
SMILES:
O=C1CCCc2ccccc12
: