Target
RAS guanyl-releasing protein 1
Ligand
BDBM50017892
Substrate
Meas. Tech.
ChEMBL_1364410 (CHEMBL3294522)
Ki
0.690000±n/a nM
Citation
 Garcia, LCDonadío, LGMann, EKolusheva, SKedei, NLewin, NEHill, CSKelsey, JSYang, JEsch, TESantos, MPeach, MLKelley, JABlumberg, PMJelinek, RMarquez, VEComin, MJ Synthesis, biological, and biophysical studies of DAG-indololactones designed as selective activators of RasGRP. Bioorg Med Chem 22:3123-40 (2014)  
Target
Name:
RAS guanyl-releasing protein 1
Synonyms:
CalDAG-GEFII GRP1_HUMAN RASGRP1 | Ras guanyl-releasing protein
Type:
PROTEIN
Mol. Mass.:
90418.98
Organism:
Homo sapiens (Human)
Description:
ChEMBL_102739
Residue:
797
  
Inhibitor
Name:
BDBM50017892
Synonyms:
CHEMBL3289014
Type:
Small organic molecule
Emp. Form.:
C24H31NO5
Mol. Mass.:
413.5066
SMILES:
CCCC(CCC)C(=O)OCC1(CO)C\C(=C/c2cccc3ccn(C)c23)C(=O)O1
: