Target
Suppressor of tumorigenicity 14 protein
Ligand
BDBM50017931
Substrate
Meas. Tech.
ChEMBL_1364433 (CHEMBL3294545)
Ki
0.08±n/a nM
Citation
 Goswami, RMukherjee, SGhadiyaram, CWohlfahrt, GSistla, RKNagaraj, JSatyam, LKSubbarao, KPalakurthy, RKGopinath, SKrishnamurthy, NRIkonen, TMoilanen, ASubramanya, HSKallio, PRamachandra, M Structure-guided discovery of 1,3,5 tri-substituted benzenes as potent and selective matriptase inhibitors exhibiting in vivo antitumor efficacy. Bioorg Med Chem 22:3187-203 (2014)  
Target
Name:
Suppressor of tumorigenicity 14 protein
Synonyms:
Epithin MT-SP1 PRSS14 SNC19 ST14_HUMAN Suppressor of tumorigenicity 14 protein TADG15
Type:
Single-pass type II membrane protein
Mol. Mass.:
94769.23
Organism:
Homo sapiens (Human)
Description:
Q9Y5Y6
Residue:
855
  
Inhibitor
Name:
BDBM50017931
Synonyms:
CHEMBL3289302
Type:
Small organic molecule
Emp. Form.:
C28H39N7O3S
Mol. Mass.:
553.719
SMILES:
NCCC1CCN(CC1)C(=O)[C@@H](Cc1cccc(c1)C(N)=N)NS(=O)(=O)c1cccc(c1)C1CCC(N)=NC1
: