Target
D(2) dopamine receptor
Ligand
BDBM50017975
Substrate
Meas. Tech.
ChEMBL_1365236 (CHEMBL3292986)
Ki
635±n/a nM
Citation
 Sampson, DZhu, XYEyunni, SVEtukala, JROfori, EBricker, BLamango, NSSetola, VRoth, BLAblordeppey, SY Identification of a new selective dopamine D4 receptor ligand. Bioorg Med Chem 22:3105-14 (2014)  
Target
Name:
D(2) dopamine receptor
Synonyms:
D(2) dopamine receptor DOPAMINE D2 Long DRD2 Dopamine D2 receptor Dopamine D2 receptor (D2R) Dopamine2-like | d2
Type:
Cell-surface receptors
Mol. Mass.:
50647.10
Organism:
Homo sapiens (Human)
Description:
P14416
Residue:
443
  
Inhibitor
Name:
BDBM50017975
Synonyms:
CHEMBL3289383
Type:
Small organic molecule
Emp. Form.:
C19H22ClFN2OS
Mol. Mass.:
380.907
SMILES:
[O-][S+](CCCN1CCN(CC1)c1ccc(Cl)cc1)c1ccc(F)cc1
: