Target
D(4) dopamine receptor
Ligand
BDBM50017975
Substrate
Meas. Tech.
ChEMBL_1365238 (CHEMBL3292988)
Ki
13±n/a nM
Citation
 Sampson, DZhu, XYEyunni, SVEtukala, JROfori, EBricker, BLamango, NSSetola, VRoth, BLAblordeppey, SY Identification of a new selective dopamine D4 receptor ligand. Bioorg Med Chem 22:3105-14 (2014)  
Target
Name:
D(4) dopamine receptor
Synonyms:
D(4) dopamine receptor DOPAMINE D4.4 Dopamine receptor | Drd4
Type:
Enzyme Catalytic Domain
Mol. Mass.:
41307.65
Organism:
RAT
Description:
DOPAMINE D4.4 0 RAT::P30729
Residue:
387
  
Inhibitor
Name:
BDBM50017975
Synonyms:
CHEMBL3289383
Type:
Small organic molecule
Emp. Form.:
C19H22ClFN2OS
Mol. Mass.:
380.907
SMILES:
[O-][S+](CCCN1CCN(CC1)c1ccc(Cl)cc1)c1ccc(F)cc1
: