Target
5-hydroxytryptamine receptor 7
Ligand
BDBM50018240
Substrate
Meas. Tech.
ChEMBL_1366807 (CHEMBL3297242)
Ki
0.800000±n/a nM
Citation
 Kolaczkowski, MMarcinkowska, MBucki, APawlowski, MMitka, KJaskowska, JKowalski, PKazek, GSiwek, AWasik, AWesolowska, AMierzejewski, PBienkowski, P Novel arylsulfonamide derivatives with 5-HT6/5-HT7 receptor antagonism targeting behavioral and psychological symptoms of dementia. J Med Chem 57:4543-57 (2014)  
Target
Name:
5-hydroxytryptamine receptor 7
Synonyms:
5-HT-7 5-HT7 5-HT7S 5HT7 HTR7 | Serotonin receptor 7
Type:
G Protein-Coupled Receptor (GPCR)
Mol. Mass.:
53573.08
Organism:
Homo sapiens (Human)
Description:
P34969
Residue:
479
  
Inhibitor
Name:
BDBM50018240
Synonyms:
CHEMBL3290005
Type:
Small organic molecule
Emp. Form.:
C25H26FN3O3S
Mol. Mass.:
467.556
SMILES:
Fc1ccc2c(noc2c1)C1CCN(CCCNS(=O)(=O)c2ccc3ccccc3c2)CC1
: