Target
Carbonic anhydrase 12
Ligand
BDBM50018628
Substrate
Meas. Tech.
ChEMBL_1362448 (CHEMBL3292804)
IC50
278±n/a nM
Citation
 Tauro, MLoiodice, FCeruso, MSupuran, CTTortorella, P Dual carbonic anhydrase/matrix metalloproteinase inhibitors incorporating bisphosphonic acid moieties targeting bone tumors. Bioorg Med Chem Lett 24:2617-20 (2014)  
Target
Name:
Carbonic anhydrase 12
Synonyms:
CA-XII CAH12_HUMAN Carbonic anhydrase Carbonic anhydrase XII Carbonic anhydrase XII (CAXII) | Tumor antigen HOM-RCC-3.1.3
Type:
Enzyme
Mol. Mass.:
39456.00
Organism:
Homo sapiens (Human)
Description:
Catalytic domain of human cloned isozyme was used in the assay
Residue:
354
  
Inhibitor
Name:
BDBM50018628
Synonyms:
CHEMBL3291003
Type:
Small organic molecule
Emp. Form.:
C8H10BrNO7P2
Mol. Mass.:
374.019
SMILES:
OP(O)(=O)C(NC(=O)c1ccc(Br)cc1)P(O)(O)=O
: