Target
Carbonic anhydrase 12
Ligand
BDBM50018629
Substrate
Meas. Tech.
ChEMBL_1362448 (CHEMBL3292804)
IC50
225±n/a nM
Citation
 Tauro, MLoiodice, FCeruso, MSupuran, CTTortorella, P Dual carbonic anhydrase/matrix metalloproteinase inhibitors incorporating bisphosphonic acid moieties targeting bone tumors. Bioorg Med Chem Lett 24:2617-20 (2014)  
Target
Name:
Carbonic anhydrase 12
Synonyms:
CA-XII CAH12_HUMAN Carbonic anhydrase Carbonic anhydrase XII Carbonic anhydrase XII (CAXII) | Tumor antigen HOM-RCC-3.1.3
Type:
Enzyme
Mol. Mass.:
39456.00
Organism:
Homo sapiens (Human)
Description:
Catalytic domain of human cloned isozyme was used in the assay
Residue:
354
  
Inhibitor
Name:
BDBM50018629
Synonyms:
CHEMBL3291004
Type:
Small organic molecule
Emp. Form.:
C7H9BrO8P2S
Mol. Mass.:
395.058
SMILES:
OP(O)(=O)C(P(O)(O)=O)S(=O)(=O)c1ccc(Br)cc1
: