Target
Carbonic anhydrase 12
Ligand
BDBM50018669
Substrate
Meas. Tech.
ChEMBL_1362448 (CHEMBL3292804)
IC50
76±n/a nM
Citation
 Tauro, MLoiodice, FCeruso, MSupuran, CTTortorella, P Dual carbonic anhydrase/matrix metalloproteinase inhibitors incorporating bisphosphonic acid moieties targeting bone tumors. Bioorg Med Chem Lett 24:2617-20 (2014)  
Target
Name:
Carbonic anhydrase 12
Synonyms:
CA-XII CAH12_HUMAN Carbonic anhydrase Carbonic anhydrase XII Carbonic anhydrase XII (CAXII) | Tumor antigen HOM-RCC-3.1.3
Type:
Enzyme
Mol. Mass.:
39456.00
Organism:
Homo sapiens (Human)
Description:
Catalytic domain of human cloned isozyme was used in the assay
Residue:
354
  
Inhibitor
Name:
BDBM50018669
Synonyms:
CHEMBL3291012
Type:
Small organic molecule
Emp. Form.:
C14H17NO9P2S
Mol. Mass.:
437.299
SMILES:
COc1ccc(cc1)-c1ccc(cc1)S(=O)(=O)NC(P(O)(O)=O)P(O)(O)=O
: