Target
Carbonic anhydrase 12
Ligand
BDBM50018670
Substrate
Meas. Tech.
ChEMBL_1362448 (CHEMBL3292804)
IC50
65±n/a nM
Citation
 Tauro, MLoiodice, FCeruso, MSupuran, CTTortorella, P Dual carbonic anhydrase/matrix metalloproteinase inhibitors incorporating bisphosphonic acid moieties targeting bone tumors. Bioorg Med Chem Lett 24:2617-20 (2014)  
Target
Name:
Carbonic anhydrase 12
Synonyms:
CA-XII CAH12_HUMAN Carbonic anhydrase Carbonic anhydrase XII Carbonic anhydrase XII (CAXII) | Tumor antigen HOM-RCC-3.1.3
Type:
Enzyme
Mol. Mass.:
39456.00
Organism:
Homo sapiens (Human)
Description:
Catalytic domain of human cloned isozyme was used in the assay
Residue:
354
  
Inhibitor
Name:
BDBM50018670
Synonyms:
CHEMBL3291013
Type:
Small organic molecule
Emp. Form.:
C13H14N2O10P2S
Mol. Mass.:
452.27
SMILES:
OP(O)(=O)C(NS(=O)(=O)c1ccc(cc1)-c1ccc(cc1)[N+]([O-])=O)P(O)(O)=O
: