Target
Retinol-binding protein 4
Ligand
BDBM50019035
Substrate
Meas. Tech.
ChEMBL_1361117 (CHEMBL3291832)
IC50
>30000±n/a nM
Citation
 Wang, YConnors, RFan, PWang, XWang, ZLiu, JKayser, FMedina, JCJohnstone, SXu, HThibault, SWalker, NConn, MZhang, YLiu, QGrillo, MPMotani, ACoward, PWang, Z Structure-assisted discovery of the first non-retinoid ligands for Retinol-Binding Protein 4. Bioorg Med Chem Lett 24:2885-91 (2014)  
Target
Name:
Retinol-binding protein 4
Synonyms:
PRBP RBP RET4_HUMAN Retinol-binding protein 4 (RBP4) | spa binding assay for rbp4
Type:
Protein
Mol. Mass.:
23008.75
Organism:
Homo sapiens (Human)
Description:
P02753
Residue:
201
  
Inhibitor
Name:
BDBM50019035
Synonyms:
CHEMBL3288139
Type:
Small organic molecule
Emp. Form.:
C17H19ClN4O2
Mol. Mass.:
346.811
SMILES:
COc1ccc(Cl)cc1NC(=O)N1CCN(CC1)c1ccccn1
: