Target
DNA-directed RNA polymerase I subunit RPA1
Ligand
BDBM50019298
Substrate
Meas. Tech.
ChEMBL_1362895 (CHEMBL3291669)
IC50
980±n/a nM
Citation
 Colis, LErnst, GSanders, SLiu, HSirajuddin, PPeltonen, KDePasquale, MBarrow, JCLaiho, M Design, synthesis, and structure-activity relationships of pyridoquinazolinecarboxamides as RNA polymerase I inhibitors. J Med Chem 57:4950-61 (2014)  
Target
Name:
DNA-directed RNA polymerase I subunit RPA1
Synonyms:
A190 DNA-directed RNA polymerase I subunit A RNA polymerase I 194 kDa subunit RPA194 | RPA1_HUMAN
Type:
PROTEIN
Mol. Mass.:
194822.12
Organism:
Homo sapiens (Human)
Description:
ChEMBL_108369
Residue:
1720
  
Inhibitor
Name:
BDBM50019298
Synonyms:
CHEMBL3289403
Type:
Small organic molecule
Emp. Form.:
C22H17N5O2
Mol. Mass.:
383.4027
SMILES:
O=C(NCCn1ccnc1)c1cccn2c1nc1cc3ccccc3cc1c2=O
: