Target
Carbonic anhydrase 12
Ligand
BDBM50019530
Substrate
Meas. Tech.
ChEMBL_1366562 (CHEMBL3296585)
Ki
3.6±n/a nM
Citation
 Slawinski, JPogorzelska, AZolnowska, BBrozewicz, KVullo, DSupuran, CT Carbonic anhydrase inhibitors. Synthesis of a novel series of 5-substituted 2,4-dichlorobenzenesulfonamides and their inhibition of human cytosolic isozymes I and II and the transmembrane tumor-associated isozymes IX and XII. Eur J Med Chem 82:47-55 (2014)  
Target
Name:
Carbonic anhydrase 12
Synonyms:
CA-XII CAH12_HUMAN Carbonic anhydrase Carbonic anhydrase XII Carbonic anhydrase XII (CAXII) | Tumor antigen HOM-RCC-3.1.3
Type:
Enzyme
Mol. Mass.:
39456.00
Organism:
Homo sapiens (Human)
Description:
Catalytic domain of human cloned isozyme was used in the assay
Residue:
354
  
Inhibitor
Name:
BDBM50019530
Synonyms:
CHEMBL3291098
Type:
Small organic molecule
Emp. Form.:
C13H12Cl2N4O5S2
Mol. Mass.:
439.294
SMILES:
NS(=O)(=O)c1ccc(NC(=O)Nc2cc(c(Cl)cc2Cl)S(N)(=O)=O)cc1
: