Target
Carbonic anhydrase 2
Ligand
BDBM50019584
Substrate
Meas. Tech.
ChEMBL_1366560 (CHEMBL3296583)
Ki
15±n/a nM
Citation
 Slawinski, JPogorzelska, AZolnowska, BBrozewicz, KVullo, DSupuran, CT Carbonic anhydrase inhibitors. Synthesis of a novel series of 5-substituted 2,4-dichlorobenzenesulfonamides and their inhibition of human cytosolic isozymes I and II and the transmembrane tumor-associated isozymes IX and XII. Eur J Med Chem 82:47-55 (2014)  
Target
Name:
Carbonic anhydrase 2
Synonyms:
CA-II CAC Carbonate dehydratase II Carbonic anhydrase 2 (CA-II) Carbonic anhydrase C Carbonic anhydrase II (CA-II) Carbonic anhydrase II (hCA II) | Carbonic anhydrase isoenzyme II (hCA II)
Type:
Enzyme
Mol. Mass.:
29250.71
Organism:
Homo sapiens (Human)
Description:
P00918
Residue:
260
  
Inhibitor
Name:
BDBM50019584
Synonyms:
CHEMBL3291093
Type:
Small organic molecule
Emp. Form.:
C14H8Cl3N3O3S
Mol. Mass.:
404.656
SMILES:
NS(=O)(=O)c1cc(-c2nnc(o2)-c2ccc(Cl)cc2)c(Cl)cc1Cl
: