Target
Carbonic anhydrase 9
Ligand
BDBM50019539
Substrate
Meas. Tech.
ChEMBL_1366561 (CHEMBL3296584)
Ki
15±n/a nM
Citation
 Slawinski, JPogorzelska, AZolnowska, BBrozewicz, KVullo, DSupuran, CT Carbonic anhydrase inhibitors. Synthesis of a novel series of 5-substituted 2,4-dichlorobenzenesulfonamides and their inhibition of human cytosolic isozymes I and II and the transmembrane tumor-associated isozymes IX and XII. Eur J Med Chem 82:47-55 (2014)  
Target
Name:
Carbonic anhydrase 9
Synonyms:
CA-IX CAH9_HUMAN Carbonic anhydrase 9 (CA IX) Carbonic anhydrase 9 precursor Carbonic anhydrase IX (CAIX) Carbonic anhydrases; II & IX MN RCC-associated antigen G250
Type:
Enzyme
Mol. Mass.:
49669.03
Organism:
Homo sapiens (Human)
Description:
Catalytic domain of human cloned isozyme was used in the assay
Residue:
459
  
Inhibitor
Name:
BDBM50019539
Synonyms:
CHEMBL3291107
Type:
Small organic molecule
Emp. Form.:
C15H14Cl2N4O6S2
Mol. Mass.:
481.331
SMILES:
Cc1ccc(cc1)S(=O)(=O)NC(=O)NNC(=O)c1cc(c(Cl)cc1Cl)S(N)(=O)=O
: