Target
Carbonic anhydrase 12
Ligand
BDBM50019579
Substrate
Meas. Tech.
ChEMBL_1366562 (CHEMBL3296585)
Ki
13±n/a nM
Citation
 Slawinski, JPogorzelska, AZolnowska, BBrozewicz, KVullo, DSupuran, CT Carbonic anhydrase inhibitors. Synthesis of a novel series of 5-substituted 2,4-dichlorobenzenesulfonamides and their inhibition of human cytosolic isozymes I and II and the transmembrane tumor-associated isozymes IX and XII. Eur J Med Chem 82:47-55 (2014)  
Target
Name:
Carbonic anhydrase 12
Synonyms:
CA-XII CAH12_HUMAN Carbonic anhydrase Carbonic anhydrase XII Carbonic anhydrase XII (CAXII) | Tumor antigen HOM-RCC-3.1.3
Type:
Enzyme
Mol. Mass.:
39456.00
Organism:
Homo sapiens (Human)
Description:
Catalytic domain of human cloned isozyme was used in the assay
Residue:
354
  
Inhibitor
Name:
BDBM50019579
Synonyms:
CHEMBL3291088
Type:
Small organic molecule
Emp. Form.:
C14H10Cl2N4O2S
Mol. Mass.:
369.226
SMILES:
NS(=O)(=O)c1cc(-c2nnc([nH]2)-c2ccccc2)c(Cl)cc1Cl
: