Target
Carbonic anhydrase 12
Ligand
BDBM50019588
Substrate
Meas. Tech.
ChEMBL_1366562 (CHEMBL3296585)
Ki
4.3±n/a nM
Citation
 Slawinski, JPogorzelska, AZolnowska, BBrozewicz, KVullo, DSupuran, CT Carbonic anhydrase inhibitors. Synthesis of a novel series of 5-substituted 2,4-dichlorobenzenesulfonamides and their inhibition of human cytosolic isozymes I and II and the transmembrane tumor-associated isozymes IX and XII. Eur J Med Chem 82:47-55 (2014)  
Target
Name:
Carbonic anhydrase 12
Synonyms:
CA-XII CAH12_HUMAN Carbonic anhydrase Carbonic anhydrase XII Carbonic anhydrase XII (CAXII) | Tumor antigen HOM-RCC-3.1.3
Type:
Enzyme
Mol. Mass.:
39456.00
Organism:
Homo sapiens (Human)
Description:
Catalytic domain of human cloned isozyme was used in the assay
Residue:
354
  
Inhibitor
Name:
BDBM50019588
Synonyms:
CHEMBL3291097
Type:
Small organic molecule
Emp. Form.:
C13H10Cl3N3O3S
Mol. Mass.:
394.661
SMILES:
NS(=O)(=O)c1cc(NC(=O)Nc2ccc(Cl)cc2)c(Cl)cc1Cl
: