Target
Cytochrome P450 2C19
Ligand
BDBM50020412
Substrate
Meas. Tech.
ChEMBL_1366636 (CHEMBL3296730)
IC50
780±n/a nM
Target
Name:
Cytochrome P450 2C19
Synonyms:
(R)-limonene 6-monooxygenase (S)-limonene 7-monooxygenase CYP2C19 CYPIIC19 Cytochrome P450 2C19 [I331V] Cytochrome P450-254C Mephenytoin 4-hydroxylase P450-254C
Type:
Enzyme
Mol. Mass.:
55935.47
Organism:
Homo sapiens (Human)
Description:
P33261
Residue:
490
  
Inhibitor
Name:
BDBM50020412
Synonyms:
CHEMBL3289811
Type:
Small organic molecule
Emp. Form.:
C19H18ClF3N4O3
Mol. Mass.:
442.819
SMILES:
Nc1nc2ccc(OC3CCOC3)nc2n1CC(O)c1ccc(cc1Cl)C(F)(F)F
: