Target
Cytochrome P450 3A4
Ligand
BDBM50020412
Substrate
Meas. Tech.
ChEMBL_1366633 (CHEMBL3296727)
IC50
2400±n/a nM
Target
Name:
Cytochrome P450 3A4
Synonyms:
Albendazole monooxygenase CP3A4_HUMAN CYP3A4 CYPIIIA4 Cytochrome P450 3A4 (CYP3A4) Nifedipine oxidase Taurochenodeoxycholate 6-alpha-hydroxylase
Type:
Enzyme
Mol. Mass.:
57349.57
Organism:
Homo sapiens (Human)
Description:
Residue:
503
  
Inhibitor
Name:
BDBM50020412
Synonyms:
CHEMBL3289811
Type:
Small organic molecule
Emp. Form.:
C19H18ClF3N4O3
Mol. Mass.:
442.819
SMILES:
Nc1nc2ccc(OC3CCOC3)nc2n1CC(O)c1ccc(cc1Cl)C(F)(F)F
: